Target
Mitogen-activated protein kinase 1
Ligand
BDBM50265966
Substrate
Meas. Tech.
ChEMBL_1700374 (CHEMBL4051356)
IC50
<0.480000±n/a nM
Citation
 Ward, RABethel, PCook, CDavies, EDebreczeni, JEFairley, GFeron, LFlemington, VGraham, MAGreenwood, RGriffin, NHanson, LHopcroft, PHoward, TDHudson, JJames, MJones, CDJones, CRLamont, SLewis, RLindsay, NRoberts, KSimpson, ISt-Gallay, SSwallow, STang, JTonge, MWang, ZZhai, B Structure-Guided Discovery of Potent and Selective Inhibitors of ERK1/2 from a Modestly Active and Promiscuous Chemical Start Point. J Med Chem 60:3438-3450 (2017)  
Target
Name:
Mitogen-activated protein kinase 1
Synonyms:
ERK2 Extracellular signal-regulated kinase 2 Extracellular signal-regulated kinase 2 (ERK2) MAPK 2 MK01_HUMAN Mitogen-activated protein kinase 1 (ERK-2) Mitogen-activated protein kinase 2 PRKM2 | p42-MAPK
Type:
Ser/Thr Protein Kinase
Mol. Mass.:
41392.76
Organism:
Homo sapiens (Human)
Description:
P28482
Residue:
360
  
Inhibitor
Name:
BDBM50265966
Synonyms:
CHEMBL4103768
Type:
Small organic molecule
Emp. Form.:
C24H27N5O2
Mol. Mass.:
417.5035
SMILES:
Cn1c2CCN(Cc3ccccc3)C(=O)c2cc1-c1ccnc(NC2CCOCC2)n1
: