Target
Mitogen-activated protein kinase 1
Ligand
BDBM50265959
Substrate
Meas. Tech.
ChEMBL_1700375 (CHEMBL4051357)
IC50
0.500000±n/a nM
Citation
 Ward, RABethel, PCook, CDavies, EDebreczeni, JEFairley, GFeron, LFlemington, VGraham, MAGreenwood, RGriffin, NHanson, LHopcroft, PHoward, TDHudson, JJames, MJones, CDJones, CRLamont, SLewis, RLindsay, NRoberts, KSimpson, ISt-Gallay, SSwallow, STang, JTonge, MWang, ZZhai, B Structure-Guided Discovery of Potent and Selective Inhibitors of ERK1/2 from a Modestly Active and Promiscuous Chemical Start Point. J Med Chem 60:3438-3450 (2017)  
Target
Name:
Mitogen-activated protein kinase 1
Synonyms:
ERK2 Extracellular signal-regulated kinase 2 Extracellular signal-regulated kinase 2 (ERK2) MAPK 2 MK01_HUMAN Mitogen-activated protein kinase 1 (ERK-2) Mitogen-activated protein kinase 2 PRKM2 | p42-MAPK
Type:
Ser/Thr Protein Kinase
Mol. Mass.:
41392.76
Organism:
Homo sapiens (Human)
Description:
P28482
Residue:
360
  
Inhibitor
Name:
BDBM50265959
Synonyms:
CHEMBL4071576
Type:
Small organic molecule
Emp. Form.:
C24H26N8O
Mol. Mass.:
442.5162
SMILES:
C[C@@H]1Cn2cc(cc2C(=O)N1Cc1cccc(C)n1)-c1nc(Nc2ccnn2C)ncc1C
: