Target
Muscarinic acetylcholine receptor M1
Ligand
BDBM50012344
Substrate
Meas. Tech.
ChEMBL_139082 (CHEMBL745818)
Ki
3±n/a nM
Citation
 Karton, YBradbury, BJBaumgold, JPaek, RJacobson, KA Functionalized congener approach to muscarinic antagonists: analogues of pirenzepine. J Med Chem 34:2133-45 (1991)  
Target
Name:
Muscarinic acetylcholine receptor M1
Synonyms:
ACM1_RAT Chrm-1 cholinergic receptor, muscarinic 1
Type:
Enzyme Catalytic Domain
Mol. Mass.:
51390.46
Organism:
RAT
Description:
P08482
Residue:
460
  
Inhibitor
Name:
BDBM50012344
Synonyms:
11-{2-[4-(10-Diethylamino-decyl)-piperazin-1-yl]-acetyl}-5,11-dihydro-benzo[e]pyrido[3,2-b][1,4]diazepin-6-one | CHEMBL303622
Type:
Small organic molecule
Emp. Form.:
C32H48N6O2
Mol. Mass.:
548.7625
SMILES:
CCN(CC)CCCCCCCCCCN1CCN(CC(=O)N2c3ccccc3C(=O)Nc3cccnc23)CC1
: