Target
Potassium-transporting ATPase alpha chain 1
Ligand
BDBM50013227
Substrate
Meas. Tech.
ChEBML_76081
IC50
3100±n/a nM
Citation
 Brown, THIfe, RJKeeling, DJLaing, SMLeach, CAParsons, MEPrice, CAReavill, DRWiggall, KJ Reversible inhibitors of the gastric (H+/K+)-ATPase. 1. 1-Aryl-4-methylpyrrolo[3,2-c]quinolines as conformationally restrained analogues of 4-(arylamino)quinolines. J Med Chem 33:527-33 (1990)  
Target
Name:
Potassium-transporting ATPase alpha chain 1
Synonyms:
ATP4A Gastric H(+)/K(+) ATPase subunit alpha Na/K-ATPase Potassium-transporting ATPase alpha chain 1 | Proton pump
Type:
Enzyme
Mol. Mass.:
114279.23
Organism:
Sus scrofa (Pig)
Description:
P19156
Residue:
1034
  
Inhibitor
Name:
BDBM50013227
Synonyms:
7-Methoxy-1-o-tolyl-1,2,3,4-tetrahydro-benzo[h][1,6]naphthyridine | CHEMBL146903
Type:
Small organic molecule
Emp. Form.:
C20H20N2O
Mol. Mass.:
304.3856
SMILES:
COc1cccc2c3N(CCCc3cnc12)c1ccccc1C
: