Target
Potassium-transporting ATPase alpha chain 1
Ligand
BDBM50013235
Substrate
Meas. Tech.
ChEBML_76081
IC50
9800.0±n/a nM
Citation
 Brown, THIfe, RJKeeling, DJLaing, SMLeach, CAParsons, MEPrice, CAReavill, DRWiggall, KJ Reversible inhibitors of the gastric (H+/K+)-ATPase. 1. 1-Aryl-4-methylpyrrolo[3,2-c]quinolines as conformationally restrained analogues of 4-(arylamino)quinolines. J Med Chem 33:527-33 (1990)  
Target
Name:
Potassium-transporting ATPase alpha chain 1
Synonyms:
ATP4A Gastric H(+)/K(+) ATPase subunit alpha Na/K-ATPase Potassium-transporting ATPase alpha chain 1 | Proton pump
Type:
Enzyme
Mol. Mass.:
114279.23
Organism:
Sus scrofa (Pig)
Description:
P19156
Residue:
1034
  
Inhibitor
Name:
BDBM50013235
Synonyms:
1-o-Tolyl-1H-imidazo[4,5-c]quinoline | CHEMBL357274
Type:
Small organic molecule
Emp. Form.:
C17H13N3
Mol. Mass.:
259.3052
SMILES:
Cc1ccccc1-n1cnc2cnc3ccccc3c12
: