Target
Toxopain-2
Ligand
BDBM50271712
Substrate
Meas. Tech.
ChEMBL_1711555 (CHEMBL4121604)
IC50
1200±n/a nM
Citation
 Zwicker, JDDiaz, NAGuerra, AJKirchhoff, PDWen, BSun, DCarruthers, VBLarsen, SD Optimization of dipeptidic inhibitors of cathepsin L for improved Toxoplasma gondii selectivity and CNS permeability. Bioorg Med Chem Lett 28:1972-1980 (2018)  
Target
Name:
Toxopain-2
Synonyms:
CPL Toxopain-2
Type:
PROTEIN
Mol. Mass.:
47549.50
Organism:
Toxoplasma gondii
Description:
ChEMBL_118107
Residue:
422
  
Inhibitor
Name:
BDBM50271712
Synonyms:
CHEMBL4128869
Type:
Small organic molecule
Emp. Form.:
C16H20FN3O2
Mol. Mass.:
305.3473
SMILES:
CC(C)(C)C[C@H](NC(=O)c1ccc(F)cc1)C(=O)NCC#N
: