Target
Renin
Ligand
BDBM50273208
Substrate
Meas. Tech.
ChEMBL_1712831 (CHEMBL4122880)
IC50
2.8±n/a nM
Citation
 Tokuhara, HImaeda, YFukase, YIwanaga, KTaya, NWatanabe, KKanagawa, RMatsuda, KKajimoto, YKusumoto, KKondo, MSnell, GBehnke, CAKuroita, T Discovery of benzimidazole derivatives as orally active renin inhibitors: Optimization of 3,5-disubstituted piperidine to improve pharmacokinetic profile. Bioorg Med Chem 26:3261-3286 (2018)  
Target
Name:
Renin
Synonyms:
Angiotensinogenase RENI_HUMAN
Type:
Enzyme
Mol. Mass.:
45058.99
Organism:
Homo sapiens (Human)
Description:
Residue:
406
  
Inhibitor
Name:
BDBM50273208
Synonyms:
CHEMBL4129831
Type:
Small organic molecule
Emp. Form.:
C29H43N5O4
Mol. Mass.:
525.6828
SMILES:
COCCCCn1c(cnc1-c1ccccc1)C(=O)N(CC(C)C)[C@@H]1CNC[C@@H](C1)C(=O)N1CCOCC1
: