Target
Renin
Ligand
BDBM50195782
Substrate
Meas. Tech.
ChEMBL_1712830 (CHEMBL4122879)
IC50
0.380000±n/a nM
Citation
 Tokuhara, HImaeda, YFukase, YIwanaga, KTaya, NWatanabe, KKanagawa, RMatsuda, KKajimoto, YKusumoto, KKondo, MSnell, GBehnke, CAKuroita, T Discovery of benzimidazole derivatives as orally active renin inhibitors: Optimization of 3,5-disubstituted piperidine to improve pharmacokinetic profile. Bioorg Med Chem 26:3261-3286 (2018)  
Target
Name:
Renin
Synonyms:
Angiotensinogenase RENI_HUMAN
Type:
Enzyme
Mol. Mass.:
45058.99
Organism:
Homo sapiens (Human)
Description:
Residue:
406
  
Inhibitor
Name:
BDBM50195782
Synonyms:
CHEMBL3958809
Type:
Small organic molecule
Emp. Form.:
C27H46N6O4
Mol. Mass.:
518.6919
SMILES:
COCCCNc1nc(ncc1C(=O)N(CC(C)C)[C@@H]1CNC[C@@H](C1)C(=O)N1CCOCC1)C(C)(C)C
: