Target
Macrophage migration inhibitory factor
Ligand
BDBM50280113
Substrate
Meas. Tech.
ChEMBL_1721668 (CHEMBL4136668)
Kd
94±n/a nM
Citation
 Dawson, TKDziedzic, PRobertson, MJCisneros, JAKrimmer, SGNewton, ASTirado-Rives, JJorgensen, WL Adding a Hydrogen Bond May Not Help: Naphthyridinone vs Quinoline Inhibitors of Macrophage Migration Inhibitory Factor. ACS Med Chem Lett 8:1287-1291 (2017)  
Target
Name:
Macrophage migration inhibitory factor
Synonyms:
GIF Glycosylation-inhibiting factor L-dopachrome tautomerase MIF/CD74 (Macrophage migration inhibitory factor and HLA-DR antigens-associated invariant chain) MMIF Macrophage migration inhibitory factor (MIF) | Phenylpyruvate tautomerase
Type:
Enzyme
Mol. Mass.:
12478.18
Organism:
Homo sapiens (Human)
Description:
P14174
Residue:
115
  
Inhibitor
Name:
BDBM50280113
Synonyms:
CHEMBL4170679
Type:
Small organic molecule
Emp. Form.:
C18H12FN5O4
Mol. Mass.:
381.3174
SMILES:
OC(=O)Cn1ccc2ccc(nc2c1=O)-c1cn(nn1)-c1ccc(O)c(F)c1
: