Target
Macrophage migration inhibitory factor
Ligand
BDBM50206090
Substrate
Meas. Tech.
ChEMBL_1721668 (CHEMBL4136668)
Kd
350±n/a nM
Citation
 Dawson, TKDziedzic, PRobertson, MJCisneros, JAKrimmer, SGNewton, ASTirado-Rives, JJorgensen, WL Adding a Hydrogen Bond May Not Help: Naphthyridinone vs Quinoline Inhibitors of Macrophage Migration Inhibitory Factor. ACS Med Chem Lett 8:1287-1291 (2017)  
Target
Name:
Macrophage migration inhibitory factor
Synonyms:
GIF Glycosylation-inhibiting factor L-dopachrome tautomerase MIF/CD74 (Macrophage migration inhibitory factor and HLA-DR antigens-associated invariant chain) MMIF Macrophage migration inhibitory factor (MIF) | Phenylpyruvate tautomerase
Type:
Enzyme
Mol. Mass.:
12478.18
Organism:
Homo sapiens (Human)
Description:
P14174
Residue:
115
  
Inhibitor
Name:
BDBM50206090
Synonyms:
CHEMBL3915405
Type:
Small organic molecule
Emp. Form.:
C23H22F3N5O5
Mol. Mass.:
505.4465
SMILES:
OC(=O)C(F)(F)F.NCCOCCOc1ccc2nc(ccc2c1)-c1cn(nn1)-c1ccc(O)cc1
: