Target
Macrophage migration inhibitory factor
Ligand
BDBM50206030
Substrate
Meas. Tech.
ChEMBL_1721668 (CHEMBL4136668)
Kd
150±n/a nM
Citation
 Dawson, TKDziedzic, PRobertson, MJCisneros, JAKrimmer, SGNewton, ASTirado-Rives, JJorgensen, WL Adding a Hydrogen Bond May Not Help: Naphthyridinone vs Quinoline Inhibitors of Macrophage Migration Inhibitory Factor. ACS Med Chem Lett 8:1287-1291 (2017)  
Target
Name:
Macrophage migration inhibitory factor
Synonyms:
GIF Glycosylation-inhibiting factor L-dopachrome tautomerase MIF/CD74 (Macrophage migration inhibitory factor and HLA-DR antigens-associated invariant chain) MMIF Macrophage migration inhibitory factor (MIF) | Phenylpyruvate tautomerase
Type:
Enzyme
Mol. Mass.:
12478.18
Organism:
Homo sapiens (Human)
Description:
P14174
Residue:
115
  
Inhibitor
Name:
BDBM50206030
Synonyms:
CHEMBL3957289 US10968198, Example 22
Type:
Small organic molecule
Emp. Form.:
C25H26FN5O4
Mol. Mass.:
479.5034
SMILES:
Oc1ccc(cc1F)-n1cc(nn1)-c1ccc2cc(OCCOCCN3CCOCC3)ccc2n1
: