Target
Renin
Ligand
BDBM50015991
Substrate
Meas. Tech.
ChEBML_195779
IC50
6±n/a nM
Citation
 Kempf, DJde Lara, EStein, HHCohen, JEgan, DAPlattner, JJ Renin inhibitors based on dipeptide analogues. Incorporation of the hydroxyethylene isostere at the P2/P3 sites. J Med Chem 33:371-4 (1990)  
Target
Name:
Renin
Synonyms:
Angiotensinogenase RENI_HUMAN
Type:
Enzyme
Mol. Mass.:
45058.99
Organism:
Homo sapiens (Human)
Description:
Residue:
406
  
Inhibitor
Name:
BDBM50015991
Synonyms:
(2S)-[{1-[1-(1-Cyclohexylmethyl-2-hydroxy-4-isobutylcarbamoyl-pent-4-enylcarbamoyl)-3-methyl-butylcarbamoyl]-2-phenyl-ethyl}-carbamic acid tert-butyl ester | CHEMBL122234
Type:
Small organic molecule
Emp. Form.:
C37H60N4O6
Mol. Mass.:
656.8955
SMILES:
CC(C)CNC(=O)C(=C)C[C@H](O)[C@H](CC1CCCCC1)NC(=O)C(CC(C)C)NC(=O)[C@H](Cc1ccccc1)NC(=O)OC(C)(C)C
: