Target
Sodium-dependent phosphate transporter 2
Ligand
BDBM50327360
Substrate
Meas. Tech.
ChEMBL_1734219 (CHEMBL4149755)
IC50
>26000±n/a nM
Citation
 Filipski, KJSammons, MFBhattacharya, SKPanteleev, JBrown, JALoria, PMBoehm, MSmith, ACShavnya, AConn, ELSong, KWeng, YFacemire, CJüppner, HClerin, V Discovery of Orally Bioavailable Selective Inhibitors of the Sodium-Phosphate Cotransporter NaPi2a (SLC34A1). ACS Med Chem Lett 9:440-445 (2018)  
Target
Name:
Sodium-dependent phosphate transporter 2
Synonyms:
GLVR-2 Gibbon ape leukemia virus receptor 2 Phosphate transporter 2 S20A2_HUMAN Sodium-dependent phosphate transporter 2 hPit2
Type:
PROTEIN
Mol. Mass.:
70391.57
Organism:
Homo sapiens
Description:
ChEMBL_118051
Residue:
652
  
Inhibitor
Name:
BDBM50327360
Synonyms:
CHEMBL4168827
Type:
Small organic molecule
Emp. Form.:
C19H19ClF3N5O
Mol. Mass.:
425.835
SMILES:
CN1CCC2(CCN(CC2)c2c(C#N)c(nc3c(Cl)c(C)[nH]c23)C(F)(F)F)C1=O
: