Target
Thromboxane-A synthase
Ligand
BDBM7962
Substrate
Meas. Tech.
ChEMBL_207628 (CHEMBL814312)
IC50
620±n/a nM
Citation
 Amemiya, YTerada, AWachi, KMiyazawa, HHatakeyama, NMatsuda, KOshima, T Synthesis and thromboxane synthetase inhibitory activity of di- or tetrahydrobenzo[b]thiophenecarboxylic acid derivatives. J Med Chem 32:1265-72 (1989)  
Target
Name:
Thromboxane-A synthase
Synonyms:
CYP5 Cytochrome P450 5A1 TBXAS1 TXA synthase TXS Thromboxane A2 Synthase (P450 TxA2) Thromboxane prostanoid Thromboxane-A synthase
Type:
Enzyme
Mol. Mass.:
60524.67
Organism:
Homo sapiens (Human)
Description:
P24557
Residue:
533
  
Inhibitor
Name:
BDBM7962
Synonyms:
4-(2-Imidazol-1-yl-ethoxy)-benzoic acid; hydrochloride 4-[2-(1H-imidazol-1-yl)ethoxy]benzoic acid CHEMBL537708 dazoxiben
Type:
Small organic molecule
Emp. Form.:
C12H12N2O3
Mol. Mass.:
232.2353
SMILES:
OC(=O)c1ccc(OCCn2ccnc2)cc1
: