Target
Potassium voltage-gated channel subfamily H member 2
Ligand
BDBM245491
Substrate
Meas. Tech.
ChEMBL_1738026 (CHEMBL4153776)
IC50
>33000±n/a nM
Citation
 Pike, KGBarlaam, BCadogan, ECampbell, AChen, YColclough, NDavies, NLde-Almeida, CDegorce, SLDidelot, MDishington, ADucray, RDurant, STHassall, LAHolmes, JHughes, GDMacFaul, PAMulholland, KRMcGuire, TMOuvry, GPass, MRobb, GStratton, NWang, ZWilson, JZhai, BZhao, KAl-Huniti, N The Identification of Potent, Selective, and Orally Available Inhibitors of Ataxia Telangiectasia Mutated (ATM) Kinase: The Discovery of AZD0156 (8-{6-[3-(Dimethylamino)propoxy]pyridin-3-yl}-3-methyl-1-(tetrahydro-2 H-pyran-4-yl)-1,3-dihydro-2 H-imidazo[4,5- c]quinolin-2-one). J Med Chem 61:3823-3841 (2018)  
Target
Name:
Potassium voltage-gated channel subfamily H member 2
Synonyms:
1,3-beta-glucan synthase component GLS2 ERG Eag-related protein 1 Ether-a-go-go-related gene (HERG) Ether-a-go-go-related gene potassium channel 1 Ether-a-go-go-related gene potassium channel 1 (hERG1) Ether-a-go-go-related protein 1 H-ERG KCNH2 Potassium voltage-gated channel subfamily H member 2 (hERG) Voltage-gated potassium channel subunit Kv11.1 hERG Potassium Channel 1 | putative potassium channel subunit
Type:
Multi-pass membrane protein
Mol. Mass.:
126672.65
Organism:
Homo sapiens (Human)
Description:
Q12809
Residue:
1159
  
Inhibitor
Name:
BDBM245491
Synonyms:
US9428503, 18
Type:
Small organic molecule
Emp. Form.:
C26H30FN5O3
Mol. Mass.:
479.5465
SMILES:
CO[C@H]1C[C@H](C1)n1c2c(cnc3ccc(cc23)-c2ccc(OCCCN(C)C)nc2F)n(C)c1=O
: