Target
Squalene monooxygenase
Ligand
BDBM50018522
Substrate
Meas. Tech.
ChEMBL_201923 (CHEMBL857627)
Ki
1000000±n/a nM
Citation
 Sen, SEPrestwich, GD Squalene analogues containing isopropylidene mimics as potential inhibitors of pig liver squalene epoxidase and oxidosqualene cyclase. J Med Chem 32:2152-8 (1989)  
Target
Name:
Squalene monooxygenase
Synonyms:
ERG1 SE Squalene epoxidase
Type:
PROTEIN
Mol. Mass.:
63936.94
Organism:
Homo sapiens (Human)
Description:
ChEMBL_201924
Residue:
574
  
Inhibitor
Name:
BDBM50018522
Synonyms:
6,10,15,19-Tetramethyl-tetracosa-6,10,14,18-tetraene-1,23-diyne-3,22-diol | CHEMBL67458
Type:
Small organic molecule
Emp. Form.:
C28H42O2
Mol. Mass.:
410.6319
SMILES:
C\C(CC\C=C(/C)CCC(O)C#C)=C/CC\C=C(/C)CC\C=C(/C)CCC(O)C#C
: