Target
Epidermal growth factor receptor
Ligand
BDBM50450875
Substrate
Meas. Tech.
ChEMBL_1743846 (CHEMBL4178356)
Ki
9.0±n/a nM
Citation
 Planken, SBehenna, DCNair, SKJohnson, TONagata, AAlmaden, CBailey, SBallard, TEBernier, LCheng, HCho-Schultz, SDalvie, DDeal, JGDinh, DMEdwards, MPFerre, RAGajiwala, KSHemkens, MKania, RSKath, JCMatthews, JMurray, BWNiessen, SOrr, STPairish, MSach, NWShen, HShi, MSolowiej, JTran, KTseng, EVicini, PWang, YWeinrich, SLZhou, RZientek, MLiu, LLuo, YXin, SZhang, CLafontaine, J Discovery of N-((3R,4R)-4-Fluoro-1-(6-((3-methoxy-1-methyl-1H-pyrazol-4-yl)amino)-9-methyl-9H-purin-2-yl)pyrrolidine-3-yl)acrylamide (PF-06747775) through Structure-Based Drug Design: A High Affinity Irreversible Inhibitor Targeting Oncogenic EGFR Mutants with Selectivity over Wild-Type EGFR. J Med Chem 60:3002-3019 (2017)  
Target
Name:
Epidermal growth factor receptor
Synonyms:
EGF Receptor Substrate EGFR_HUMAN ERBB1 Epidermal Growth Factor Receptor erbB-1 Epidermal growth factor receptor (EGFR) HER1 Proto-oncogene c-ErbB-1 Tyrosine-Protein Kinase ErbB-1
Type:
Receptor Kinase Domain
Mol. Mass.:
134279.59
Organism:
Homo sapiens (Human)
Description:
P00533
Residue:
1210
  
Inhibitor
Name:
BDBM50450875
Synonyms:
CHEMBL4208811
Type:
Small organic molecule
Emp. Form.:
C26H35N9O
Mol. Mass.:
489.6158
SMILES:
CC(C)n1cnc2c(Nc3ccc(cc3)N3CCN(C)CC3)nc(nc12)N1CC[C@@H](C1)NC(=O)C=C
: