Target
Lysine-specific demethylase 4C
Ligand
BDBM50454844
Substrate
Meas. Tech.
ChEMBL_1753421 (CHEMBL4188181)
IC50
2.2±n/a nM
Citation
 Passioura, TBhushan, BTumber, AKawamura, ASuga, H Structure-activity studies of a macrocyclic peptide inhibitor of histone lysine demethylase 4A. Bioorg Med Chem 26:1225-1231 (2018)  
Target
Name:
Lysine-specific demethylase 4C
Synonyms:
GASC-1 protein Gene amplified in squamous cell carcinoma 1 protein JMJD2C Jumonji domain-containing protein 2C KDM4C_HUMAN | KIAA0780
Type:
Protein
Mol. Mass.:
119979.01
Organism:
Homo sapiens (Human)
Description:
Q9H3R0
Residue:
1056
  
Inhibitor
Name:
BDBM50454844
Synonyms:
CHEMBL4204694
Type:
Small organic molecule
Emp. Form.:
C88H124N24O20S
Mol. Mass.:
1870.14
SMILES:
[H][C@]1(NC(=O)[C@@H](Cc2ccc(O)cc2)NC(=O)CSC[C@H](NC(=O)[C@H](Cc2ccc(O)cc2)NC(=O)[C@H](Cc2ccc(O)cc2)NC(=O)[C@H](Cc2ccccc2)NC(=O)[C@@H](NC(=O)[C@@]([H])(NC(=O)CNC(=O)[C@H](CO)NC(=O)[C@H](CCCNC(N)=N)NC(=O)[C@H](CCCNC(N)=N)NC(=O)[C@H](Cc2ccccc2)NC(=O)[C@H](CCCNC(N)=N)NC1=O)[C@@H](C)CC)C(C)C)C(N)=O)[C@H](C)O
: