Target
Acetylcholinesterase
Ligand
BDBM50327939
Substrate
Meas. Tech.
ChEMBL_1763446 (CHEMBL4198693)
IC50
10000±n/a nM
Citation
 Hepnarova, VKorabecny, JMatouskova, LJost, PMuckova, LHrabinova, MVykoukalova, NKerhartova, MKucera, TDolezal, RNepovimova, ESpilovska, KMezeiova, EPham, NLJun, DStaud, FKaping, DKuca, KSoukup, O The concept of hybrid molecules of tacrine and benzyl quinolone carboxylic acid (BQCA) as multifunctional agents for Alzheimer's disease. Eur J Med Chem 150:292-306 (2018)  
Target
Name:
Acetylcholinesterase
Synonyms:
ACES_HUMAN Acetylcholinesterase (AChE) | Acetylcholinesterase (human AChE)
Type:
Enzyme
Mol. Mass.:
67792.70
Organism:
Homo sapiens (Human)
Description:
P22303
Residue:
614
  
Inhibitor
Name:
BDBM50327939
Synonyms:
7-methoxytacrine | CHEMBL1256415
Type:
Small organic molecule
Emp. Form.:
C14H16N2O
Mol. Mass.:
228.2896
SMILES:
COc1ccc2nc3CCCCc3c(N)c2c1
: