Target
Renin
Ligand
BDBM50022619
Substrate
Meas. Tech.
ChEBML_195784
IC50
0.300000±n/a nM
Citation
 Luly, JRBaMaung, NSoderquist, JFung, AKStein, HKleinert, HDMarcotte, PAEgan, DABopp, BMerits, I Renin inhibitors. Dipeptide analogues of angiotensinogen utilizing a dihydroxyethylene transition-state mimic at the scissile bond to impart greater inhibitory potency. J Med Chem 31:2264-76 (1989)  
Target
Name:
Renin
Synonyms:
Angiotensinogenase RENI_HUMAN
Type:
Enzyme
Mol. Mass.:
45058.99
Organism:
Homo sapiens (Human)
Description:
Residue:
406
  
Inhibitor
Name:
BDBM50022619
Synonyms:
CHEMBL3348544 | N-[1-(1-Cyclohexylmethyl-2,3-dihydroxy-5-methyl-hexylcarbamoyl)-2-(4H-imidazol-4-yl)-ethyl]-2-isobutylamino-3-phenyl-propionamide
Type:
Small organic molecule
Emp. Form.:
C33H53N5O4
Mol. Mass.:
583.805
SMILES:
CC(C)CN[C@@H](Cc1ccccc1)C(=O)N[C@@H](Cc1c[nH]cn1)C(=O)N[C@@H](CC1CCCCC1)[C@@H](O)[C@@H](O)CC(C)C
: