Target
Voltage-dependent N-type calcium channel subunit alpha-1B
Ligand
BDBM50465800
Substrate
Meas. Tech.
ChEMBL_1788778 (CHEMBL4260512)
IC50
29±n/a nM
Citation
 Wall, MJSubasinghe, NLWinters, MPLubin, MLFinley, MFAQin, NBrandt, MRNeeper, MPSchneider, CRColburn, RWFlores, CMSui, Z Discovery and optimization of a novel series of pyrazolyltetrahydropyran N-type calcium channel (Ca Bioorg Med Chem Lett 28:3780-3783 (2018)  
Target
Name:
Voltage-dependent N-type calcium channel subunit alpha-1B
Synonyms:
BIII CAC1B_HUMAN CACNA1B Calcium channel (Type N) Voltage-dependent N-type calcium channel subunit alpha-1B Voltage-gated N-type calcium channel alpha-1B subunit Voltage-gated calcium channel Voltage-gated calcium channel subunit alpha Cav2.2 ((alpha 1B, beta 1b, alpha 2 delta-1) | calcium channel, voltage-dependent, N type, alpha 1B subunit
Type:
Enzyme
Mol. Mass.:
262548.16
Organism:
Homo sapiens (Human)
Description:
Q00975
Residue:
2339
  
Inhibitor
Name:
BDBM50465800
Synonyms:
CHEMBL4282095
Type:
Small organic molecule
Emp. Form.:
C27H34N2O3
Mol. Mass.:
434.5705
SMILES:
CCOc1ccc(cc1)-c1cc(nn1-c1ccccc1OC)C1CC(C)(C)OC(C)(C)C1
: