Target
Toll-like receptor 9
Ligand
BDBM50467786
Substrate
Meas. Tech.
ChEMBL_1796971 (CHEMBL4269088)
IC50
30±n/a nM
Citation
 Paul, BRahaman, ORoy, SPal, SSatish, SMukherjee, AGhosh, ARRaychaudhuri, DBhattacharya, RGoon, SGanguly, DTalukdar, A Activity-guided development of potent and selective toll-like receptor 9 antagonists. Eur J Med Chem 159:187-205 (2018)  
Target
Name:
Toll-like receptor 9
Synonyms:
CD_antigen: CD289 TLR9_HUMAN
Type:
Enzyme
Mol. Mass.:
115889.91
Organism:
Homo sapiens (Human)
Description:
Q9NR96
Residue:
1032
  
Inhibitor
Name:
BDBM50467786
Synonyms:
CHEMBL4281194
Type:
Small organic molecule
Emp. Form.:
C28H44N6O2
Mol. Mass.:
496.688
SMILES:
COc1cc2c(nc(nc2cc1OCCCN1CCCC1)N(C)C)N1CCN(CC2CCCC2)CC1
: