Target
Toll-like receptor 7
Ligand
BDBM50467786
Substrate
Meas. Tech.
ChEMBL_1796972 (CHEMBL4269089)
IC50
700±n/a nM
Citation
 Paul, BRahaman, ORoy, SPal, SSatish, SMukherjee, AGhosh, ARRaychaudhuri, DBhattacharya, RGoon, SGanguly, DTalukdar, A Activity-guided development of potent and selective toll-like receptor 9 antagonists. Eur J Med Chem 159:187-205 (2018)  
Target
Name:
Toll-like receptor 7
Synonyms:
ORF Names:UNQ248/PRO285 TLR7_HUMAN | Toll-like receptor 7 (TLR7)
Type:
Enzyme
Mol. Mass.:
120945.35
Organism:
Homo sapiens (Human)
Description:
Q9NYK1
Residue:
1049
  
Inhibitor
Name:
BDBM50467786
Synonyms:
CHEMBL4281194
Type:
Small organic molecule
Emp. Form.:
C28H44N6O2
Mol. Mass.:
496.688
SMILES:
COc1cc2c(nc(nc2cc1OCCCN1CCCC1)N(C)C)N1CCN(CC2CCCC2)CC1
: