Target
Serine/threonine-protein kinase ATR
Ligand
BDBM50427297
Substrate
Meas. Tech.
ChEMBL_1797560 (CHEMBL4269677)
IC50
15±n/a nM
Citation
 Foote, KMNissink, JWMMcGuire, TTurner, PGuichard, SYates, JWTLau, ABlades, KHeathcote, DOdedra, RWilkinson, GWilson, ZWood, CMJewsbury, PJ Discovery and Characterization of AZD6738, a Potent Inhibitor of Ataxia Telangiectasia Mutated and Rad3 Related (ATR) Kinase with Application as an Anticancer Agent. J Med Chem 61:9889-9907 (2018)  
Target
Name:
Serine/threonine-protein kinase ATR
Synonyms:
ATR Ataxia telangiectasia and Rad3-related protein (ATR) FRP1 | Serine-protein kinase ATR
Type:
Protein
Mol. Mass.:
301404.58
Organism:
Homo sapiens (Human)
Description:
Q13535
Residue:
2644
  
Inhibitor
Name:
BDBM50427297
Synonyms:
CHEMBL2325439
Type:
Small organic molecule
Emp. Form.:
C20H21FN4O3S
Mol. Mass.:
416.469
SMILES:
CS(=O)(=O)C1(CC1)c1cc(nc(n1)-c1cc(F)cc2[nH]ccc12)N1CCOCC1
: