Target
Serine/threonine-protein kinase ATR
Ligand
BDBM103471
Substrate
Meas. Tech.
ChEMBL_1797561 (CHEMBL4269678)
IC50
14±n/a nM
Citation
 Foote, KMNissink, JWMMcGuire, TTurner, PGuichard, SYates, JWTLau, ABlades, KHeathcote, DOdedra, RWilkinson, GWilson, ZWood, CMJewsbury, PJ Discovery and Characterization of AZD6738, a Potent Inhibitor of Ataxia Telangiectasia Mutated and Rad3 Related (ATR) Kinase with Application as an Anticancer Agent. J Med Chem 61:9889-9907 (2018)  
Target
Name:
Serine/threonine-protein kinase ATR
Synonyms:
ATR Ataxia telangiectasia and Rad3-related protein (ATR) FRP1 | Serine-protein kinase ATR
Type:
Protein
Mol. Mass.:
301404.58
Organism:
Homo sapiens (Human)
Description:
Q13535
Residue:
2644
  
Inhibitor
Name:
BDBM103471
Synonyms:
BDBM50456371 | US8552004, 2.11
Type:
Small organic molecule
Emp. Form.:
C20H24N6O2S
Mol. Mass.:
412.509
SMILES:
C[C@@H]1COCCN1c1cc(nc(n1)-c1cncc2[nH]ccc12)C1(CC1)S(C)(=N)=O
: