Target
Falcipain 2
Ligand
BDBM50468723
Substrate
Meas. Tech.
ChEMBL_1801047 (CHEMBL4273339)
Ki
1260±n/a nM
Citation
 Fey, PChartomatsidou, RKiefer, WMottram, JCKersten, CSchirmeister, T New aziridine-based inhibitors of cathepsin L-like cysteine proteases with selectivity for the Leishmania cysteine protease LmCPB2.8. Eur J Med Chem 156:587-597 (2018)  
Target
Name:
Falcipain 2
Synonyms:
Cysteine protease falcipain-2 Falcipain-2
Type:
Enzyme
Mol. Mass.:
55912.60
Organism:
Plasmodium falciparum
Description:
Recombinant falcipain-2.
Residue:
484
  
Inhibitor
Name:
BDBM50468723
Synonyms:
CHEMBL4279824
Type:
Small organic molecule
Emp. Form.:
C28H39N3O8
Mol. Mass.:
545.6246
SMILES:
CC(C)C[C@H](NC(=O)OC(C)(C)C)C(=O)N1CCC[C@@H]1C(=O)N1C(C1C(=O)OCCc1ccccc1)C(O)=O
: