Target
Falcipain 2
Ligand
BDBM50183776
Substrate
Meas. Tech.
ChEMBL_1801047 (CHEMBL4273339)
Ki
43900±n/a nM
Citation
 Fey, PChartomatsidou, RKiefer, WMottram, JCKersten, CSchirmeister, T New aziridine-based inhibitors of cathepsin L-like cysteine proteases with selectivity for the Leishmania cysteine protease LmCPB2.8. Eur J Med Chem 156:587-597 (2018)  
Target
Name:
Falcipain 2
Synonyms:
Cysteine protease falcipain-2 Falcipain-2
Type:
Enzyme
Mol. Mass.:
55912.60
Organism:
Plasmodium falciparum
Description:
Recombinant falcipain-2.
Residue:
484
  
Inhibitor
Name:
BDBM50183776
Synonyms:
(2S,3S)-dibenzyl 1-((R)-1-((S)-2-(tert-butoxycarbonyl)-4-methylpentanoyl)pyrrolidine-5-carbonyl)aziridine-2,3-dicarboxylate | CHEMBL380076
Type:
Small organic molecule
Emp. Form.:
C34H43N3O8
Mol. Mass.:
621.7205
SMILES:
CC(C)C[C@H](NC(=O)OC(C)(C)C)C(=O)N1CCC[C@@H]1C(=O)N1[C@@H]([C@H]1C(=O)OCc1ccccc1)C(=O)OCc1ccccc1
: