Target
Cannabinoid receptor 1
Ligand
BDBM208271
Substrate
Meas. Tech.
ChEMBL_1803980 (CHEMBL4276272)
IC50
1.3±n/a nM
Citation
 Zhang, YMGreco, MNMacielag, MJTeleha, CADesJarlais, RLTang, YHo, GHou, CChen, CZhao, SKauffman, JCamacho, RQi, JMurray, WDemarest, KLeonard, J 6-Benzhydryl-4-amino-quinolin-2-ones as Potent Cannabinoid Type 1 (CB J Med Chem 61:10276-10298 (2018)  
Target
Name:
Cannabinoid receptor 1
Synonyms:
CANN6 CB-R CNR CNR1_HUMAN Cannabinoid receptor Cannabinoid receptor 1 (brain)
Type:
G Protein-Coupled Receptor (GPCR)
Mol. Mass.:
52868.96
Organism:
Homo sapiens (Human)
Description:
P21554
Residue:
472
  
Inhibitor
Name:
BDBM208271
Synonyms:
US9266835, 44
Type:
Small organic molecule
Emp. Form.:
C28H24Cl2F3N3O3S
Mol. Mass.:
610.475
SMILES:
FC(F)(F)S(=O)(=O)N1CCC(CC1)Nc1cc(=O)[nH]c2ccc(cc12)C(c1ccc(Cl)cc1)c1ccc(Cl)cc1
: