Target
Inositol 1,4,5-trisphosphate receptor type 2
Ligand
BDBM50075183
Substrate
Meas. Tech.
ChEMBL_90086 (CHEMBL701347)
IC50
52±n/a nM
Citation
 Liu, CDavis, RJNahorski, SRBallereau, SSpiess, BPotter, BV Synthesis, calcium mobilizing, and physicochemical properties of D-chiro-inositol 1,3,4,6-tetrakisphosphate, a novel and potent ligand at the D-myo-inositol 1,4,5-trisphosphate receptor. J Med Chem 42:1991-8 (1999)  
Target
Name:
Inositol 1,4,5-trisphosphate receptor type 2
Synonyms:
IP3 receptor isoform 2 ITPR2 Inositol 1,4,5-trisphosphate receptor type 2 Type 2 InsP3 receptor | Type 2 inositol 1,4,5-trisphosphate receptor
Type:
PROTEIN
Mol. Mass.:
308054.69
Organism:
Homo sapiens (Human)
Description:
ChEMBL_104973
Residue:
2701
  
Inhibitor
Name:
BDBM50075183
Synonyms:
1,4,5-Insp3 1D-myo-inositol 1,4,5-tris(dihydrogen phosphate) 3,5,6-trioxyphosphate-1,2,4-cyclohexanetriol D-myo-inositol 1,4,5-trisphosphate InsP3
Type:
Small organic molecule
Emp. Form.:
C6H15O15P3
Mol. Mass.:
420.0956
SMILES:
O[C@@H]1[C@H](O)[C@@H](OP(O)(O)=O)[C@H](OP(O)(O)=O)[C@@H](O)[C@@H]1OP(O)(O)=O
: