Target
Gag-Pol polyprotein [489-587]
Ligand
BDBM1135
Substrate
Meas. Tech.
ChEMBL_158035 (CHEMBL768259)
Ki
186±n/a nM
Citation
 Nair, ACJayatilleke, PWang, XMiertus, SWelsh, WJ Computational studies on tetrahydropyrimidine-2-one HIV-1 protease inhibitors: improving three-dimensional quantitative structure-activity relationship comparative molecular field analysis models by inclusion of calculated inhibitor- and receptor-based properties. J Med Chem 45:973-83 (2002)  
Target
Name:
Gag-Pol polyprotein [489-587]
Synonyms:
Human immunodeficiency virus type 1 protease Pol polyprotein | gag-pol
Type:
Enzyme Subunit
Mol. Mass.:
10781.16
Organism:
Human immunodeficiency virus type 1
Description:
P04585[489-587]
Residue:
99
  
Inhibitor
Name:
BDBM1135
Synonyms:
(4R,5S,6S)-1,3,4-tribenzyl-6-(1-bromo-2-phenylethyl)-5-hydroxy-1,3-diazinan-2-one Tetrahydropyrimidinone deriv. 18a
Type:
Small Organic Molecule
Emp. Form.:
C33H33BrN2O2
Mol. Mass.:
569.531
SMILES:
O[C@H]1[C@@H](Cc2ccccc2)N(Cc2ccccc2)C(=O)N(Cc2ccccc2)[C@@H]1[C@@H](Br)Cc1ccccc1
: