Target
Leucyl-cystinyl aminopeptidase
Ligand
BDBM50478356
Substrate
Meas. Tech.
ChEMBL_477343 (CHEMBL936433)
Ki
110±n/a nM
Citation
 Lukaszuk, ADemaegdt, HSzemenyei, ETóth, GTymecka, DMisicka, AKaroyan, PVanderheyden, PVauquelin, GTourwé, D Beta-homo-amino acid scan of angiotensin IV. J Med Chem 51:2291-6 (2008)  
Target
Name:
Leucyl-cystinyl aminopeptidase
Synonyms:
Aminopeptidase Cystinyl aminopeptidase Insulin-regulated membrane aminopeptidase LCAP_HUMAN Leucyl-cystinyl aminopeptidase, pregnancy serum form Oxytocinase Placental leucine aminopeptidase
Type:
PROTEIN
Mol. Mass.:
117334.10
Organism:
Homo sapiens (Human)
Description:
ChEMBL_1473494
Residue:
1025
  
Inhibitor
Name:
BDBM50478356
Synonyms:
CHEMBL408132
Type:
Small organic molecule
Emp. Form.:
C41H56N8O8
Mol. Mass.:
788.9321
SMILES:
CC[C@H](C)[C@H](NC(=O)[C@H](Cc1ccc(O)cc1)NC(=O)[C@@H](N)C(C)C)C(=O)N[C@@H](Cc1cnc[nH]1)C(=O)N1CCC[C@H]1C(=O)NC[C@H](Cc1ccccc1)C(O)=O
: