Target
Genome polyprotein
Ligand
BDBM50485489
Substrate
Meas. Tech.
ChEMBL_830851 (CHEMBL2065357)
Ki
27±n/a nM
Target
Name:
Genome polyprotein
Synonyms:
Genome polyprotein
Type:
PROTEIN
Mol. Mass.:
74061.95
Organism:
Hepacivirus C
Description:
ChEMBL_118425
Residue:
694
  
Inhibitor
Name:
BDBM50485489
Synonyms:
CHEMBL1672609 | MK-1220
Type:
Small organic molecule
Emp. Form.:
C40H53N5O9S
Mol. Mass.:
779.942
SMILES:
[H][C@@]12C[C@H](N(C1)C(=O)[C@@H](NC(=O)OCC(C)(C)CCCc1cc3c(O2)nccc3cc1OC)C1CCCCC1)C(=O)N[C@@]1(C[C@H]1C=C)C(=O)NS(=O)(=O)C1CC1
: