Target
Genome polyprotein
Ligand
BDBM50485494
Substrate
Meas. Tech.
ChEMBL_830849 (CHEMBL2065355)
Ki
2.9±n/a nM
Target
Name:
Genome polyprotein
Synonyms:
Genome polyprotein
Type:
PROTEIN
Mol. Mass.:
74061.95
Organism:
Hepacivirus C
Description:
ChEMBL_118425
Residue:
694
  
Inhibitor
Name:
BDBM50485494
Synonyms:
CHEMBL2063089
Type:
Small organic molecule
Emp. Form.:
C39H51N5O9S
Mol. Mass.:
765.915
SMILES:
[H][C@@]12C[C@@]1([H])OC(=O)N[C@H](C(=O)N1C[C@@]([H])(C[C@H]1C(=O)N[C@@]1(C[C@@]1([H])C=C)C(=O)NS(=O)(=O)C1CC1)Oc1cc3cc(OC)ccc3nc1CCCCC2)C(C)(C)C
: