Target
Genome polyprotein
Ligand
BDBM50485491
Substrate
Meas. Tech.
ChEMBL_830850 (CHEMBL2065356)
Ki
11±n/a nM
Target
Name:
Genome polyprotein
Synonyms:
Genome polyprotein
Type:
PROTEIN
Mol. Mass.:
74061.95
Organism:
Hepacivirus C
Description:
ChEMBL_118425
Residue:
694
  
Inhibitor
Name:
BDBM50485491
Synonyms:
CHEMBL2063088
Type:
Small organic molecule
Emp. Form.:
C41H55N5O9S
Mol. Mass.:
793.969
SMILES:
[H][C@@]12C[C@H](N(C1)C(=O)[C@@H](NC(=O)O[C@]1([H])CCC[C@@]1([H])CCCCCc1nc3ccc(OC)cc3cc1O2)C(C)(C)C)C(=O)N[C@@]1(C[C@H]1C=C)C(=O)NS(=O)(=O)C1CC1
: