Target
Genome polyprotein
Ligand
BDBM50485493
Substrate
Meas. Tech.
ChEMBL_830849 (CHEMBL2065355)
Ki
27±n/a nM
Target
Name:
Genome polyprotein
Synonyms:
Genome polyprotein
Type:
PROTEIN
Mol. Mass.:
74061.95
Organism:
Hepacivirus C
Description:
ChEMBL_118425
Residue:
694
  
Inhibitor
Name:
BDBM50485493
Synonyms:
CHEMBL2063086
Type:
Small organic molecule
Emp. Form.:
C41H55N5O8S
Mol. Mass.:
777.969
SMILES:
[H][C@@]12C[C@H](N(C1)C(=O)[C@@H](NC(=O)OCC(C)(C)CCCCCc1nc3ccccc3cc1O2)C1CCCCC1)C(=O)N[C@@]1(C[C@H]1C=C)C(=O)NS(=O)(=O)C1CC1
: