Target
Genome polyprotein
Ligand
BDBM50485492
Substrate
Meas. Tech.
ChEMBL_830850 (CHEMBL2065356)
Ki
12±n/a nM
Target
Name:
Genome polyprotein
Synonyms:
Genome polyprotein
Type:
PROTEIN
Mol. Mass.:
74061.95
Organism:
Hepacivirus C
Description:
ChEMBL_118425
Residue:
694
  
Inhibitor
Name:
BDBM50485492
Synonyms:
Grazoprevir MK-5172 MK-5172 MONOHYDRATE
Type:
Small organic molecule
Emp. Form.:
C38H50N6O9S
Mol. Mass.:
766.903
SMILES:
[H][C@@]12C[C@@]1([H])OC(=O)N[C@H](C(=O)N1C[C@@]([H])(C[C@H]1C(=O)N[C@@]1(C[C@H]1C=C)C(=O)NS(=O)(=O)C1CC1)Oc1nc3cc(OC)ccc3nc1CCCCC2)C(C)(C)C
: