Target
Phosphatidylinositol 4,5-bisphosphate 3-kinase catalytic subunit beta isoform
Ligand
BDBM50489446
Substrate
Meas. Tech.
ChEMBL_940305 (CHEMBL2328807)
EC50
63±n/a nM
Citation
 Yu, HMoore, MLErhard, KHardwicke, MALin, HLuengo, JIMcSurdy-Freed, JPlant, RQu, JRaha, KRominger, CMSchaber, MDSpengler, MDRivero, RA [3a,4]-Dihydropyrazolo[1,5a]pyrimidines: Novel, Potent, and Selective Phosphatidylinositol-3-kinase ? Inhibitors. ACS Med Chem Lett 4:230-4 (2013)  
Target
Name:
Phosphatidylinositol 4,5-bisphosphate 3-kinase catalytic subunit beta isoform
Synonyms:
PI3-kinase p110 subunit beta PI3Kbeta PIK3CB Phosphatidylinositol 4,5-bisphosphate 3-kinase catalytic subunit beta (PI3Kbeta) Phosphatidylinositol 4,5-bisphosphate 3-kinase catalytic subunit beta isoform (PI3K) Phosphatidylinositol 4,5-bisphosphate 3-kinase catalytic subunit beta isoform (PI3Kbeta) Phosphatidylinositol-4,5-bisphosphate 3-kinase catalytic subunit beta isoform Phosphoinositide 3-Kinase (PI3K), beta Chain A PtdIns-3-kinase p110
Type:
Enzyme Subunit
Mol. Mass.:
122769.00
Organism:
Homo sapiens (Human)
Description:
P42338
Residue:
1070
  
Inhibitor
Name:
BDBM50489446
Synonyms:
CHEMBL2322336
Type:
Small organic molecule
Emp. Form.:
C19H19F3N4O2
Mol. Mass.:
392.375
SMILES:
Cc1c(Cc2cnn3c(O)cc(nc23)N2CCOCC2)cccc1C(F)(F)F
: