Target
Sigma non-opioid intracellular receptor 1
Ligand
BDBM50036723
Substrate
Meas. Tech.
ChEBML_201714
IC50
100±n/a nM
Citation
 Schuster, DIPan, YPSingh, GStoupakis, GCai, BLem, GEhrlich, GKFrietze, WMurphy, RB N-(1-arylpropionyl)-4-aryltetrahydropyridines, a new class of high-affinity selective sigma receptor ligands. J Med Chem 36:3923-8 (1994)  
Target
Name:
Sigma non-opioid intracellular receptor 1
Synonyms:
Aging-associated gene 8 protein SGMR1_HUMAN SIGMAR1 SR31747-binding protein Sigma 1-type opioid receptor Sigma1R | hSigmaR1
Type:
Enzyme Catalytic Domain
Mol. Mass.:
25124.85
Organism:
Homo sapiens (Human)
Description:
Q99720
Residue:
223
  
Inhibitor
Name:
BDBM50036723
Synonyms:
1-(4-Bromo-phenyl)-3-[4-(4-chloro-phenyl)-3,6-dihydro-2H-pyridin-1-yl]-propan-1-one | CHEMBL127067
Type:
Small organic molecule
Emp. Form.:
C20H19BrClNO
Mol. Mass.:
404.728
SMILES:
Clc1ccc(cc1)C1=CCN(CCC(=O)c2ccc(Br)cc2)CC1
: