Target
5-lipoxygenase
Ligand
BDBM50038660
Substrate
Meas. Tech.
ChEMBL_3987 (CHEMBL619259)
IC50
4000±n/a nM
Citation
 Laufer, SAAugustin, JDannhardt, GKiefer, W (6,7-Diaryldihydropyrrolizin-5-yl)acetic acids, a novel class of potent dual inhibitors of both cyclooxygenase and 5-lipoxygenase. J Med Chem 37:1894-7 (1994)  
Target
Name:
5-lipoxygenase
Synonyms:
Arachidonate 5-lipoxygenase
Type:
PROTEIN
Mol. Mass.:
49994.23
Organism:
Bos taurus
Description:
ChEMBL_157766
Residue:
430
  
Inhibitor
Name:
BDBM50038660
Synonyms:
(6,6-Dimethyl-1,2-diphenyl-6,7-dihydro-5H-pyrrolizin-3-yl)-acetic acid | CHEMBL54506
Type:
Small organic molecule
Emp. Form.:
C23H23NO2
Mol. Mass.:
345.4342
SMILES:
CC1(C)Cc2c(c(c(CC(O)=O)n2C1)-c1ccccc1)-c1ccccc1
: