Target
Integrin alpha-IIb/beta-3
Ligand
BDBM50039582
Substrate
Meas. Tech.
ChEMBL_158860 (CHEMBL761745)
IC50
22000±n/a nM
Citation
 Egbertson, MSChang, CTDuggan, MEGould, RJHalczenko, WHartman, GDLaswell, WLLynch, JJLynch, RJManno, PD Non-peptide fibrinogen receptor antagonists. 2. Optimization of a tyrosine template as a mimic for Arg-Gly-Asp. J Med Chem 37:2537-51 (1994)  
Target
Name:
Integrin alpha-IIb/beta-3
Synonyms:
Glycoprotein IIb/IIIa
Type:
Mol. Mass.:
Description:
ASSAY_ID of EBI is 30109
Components:
This complex has 2 components.
Component 1
Name:
Integrin beta-3
Synonyms:
CD_antigen=CD61 GPIIIa ITGB3 Platelet membrane glycoprotein IIIa
Type:
Protein
Mol. Mass.:
87038.91
Organism:
Homo sapiens (Human)
Description:
P05106
Residue:
788
  
Component 2
Name:
Integrin alpha-IIb
Synonyms:
CD_antigen=CD41 GPIIb Glycoprotein IIb ITGA2B Integrin alpha-IIb heavy chain Integrin alpha-IIb light chain, form 2 Integrin alpha-V/beta-3 and alpha-IIb/beta 3 | Platelet membrane glycoprotein IIb
Type:
Protein
Mol. Mass.:
113354.85
Organism:
Homo sapiens (Human)
Description:
P08514
Residue:
1039
  
Inhibitor
Name:
BDBM50039582
Synonyms:
(S)-2-(Benzyloxycarbonyl-methyl-amino)-3-[4-(4-piperidin-4-yl-butoxy)-phenyl]-propionic acid | CHEMBL84947
Type:
Small organic molecule
Emp. Form.:
C27H36N2O5
Mol. Mass.:
468.5851
SMILES:
CN([C@@H](Cc1ccc(OCCCCC2CCNCC2)cc1)C(O)=O)C(=O)OCc1ccccc1
: