Target
Integrin alpha-V/beta-3
Ligand
BDBM50039573
Substrate
Meas. Tech.
ChEMBL_214622 (CHEMBL819702)
IC50
14000±n/a nM
Citation
 Egbertson, MSChang, CTDuggan, MEGould, RJHalczenko, WHartman, GDLaswell, WLLynch, JJLynch, RJManno, PD Non-peptide fibrinogen receptor antagonists. 2. Optimization of a tyrosine template as a mimic for Arg-Gly-Asp. J Med Chem 37:2537-51 (1994)  
Target
Name:
Integrin alpha-V/beta-3
Synonyms:
ITGAV/ITGB3 | Integrin beta-3/Vitronectin receptor alpha
Type:
Enzyme
Mol. Mass.:
Description:
Components:
This complex has 2 components.
Component 1
Name:
Integrin alpha-V
Synonyms:
ITAV_HUMAN Integrin alpha-V/alpha-5 VNRA Vitronectin receptor | Vitronectin receptor subunit alpha
Type:
PROTEIN
Mol. Mass.:
116024.92
Organism:
Homo sapiens (Human)
Description:
ChEMBL_582336
Residue:
1048
  
Component 2
Name:
Integrin beta-3
Synonyms:
CD_antigen=CD61 GPIIIa ITGB3 Platelet membrane glycoprotein IIIa
Type:
Protein
Mol. Mass.:
87038.91
Organism:
Homo sapiens (Human)
Description:
P05106
Residue:
788
  
Inhibitor
Name:
BDBM50039573
Synonyms:
2-[1-[1-amino-4-amino(imino)methylamino-(1S)-butylcarboxamidomethylcarboxamido]-2-carboxy-(1S)-ethylcarboxamido]-3-(1H-3-indolyl)-(2S)-propanoic acid | CHEMBL87188
Type:
Small organic molecule
Emp. Form.:
C23H32N8O7
Mol. Mass.:
532.5496
SMILES:
N[C@@H](CCCNC(N)=N)C(=O)NCC(=O)N[C@@H](CC(O)=O)C(=O)N[C@@H](Cc1c[nH]c2ccccc12)C(O)=O
: