Target
Integrin alpha-V/beta-3
Ligand
BDBM50004060
Substrate
Meas. Tech.
ChEMBL_214623 (CHEMBL819703)
IC50
56000±n/a nM
Citation
 Egbertson, MSChang, CTDuggan, MEGould, RJHalczenko, WHartman, GDLaswell, WLLynch, JJLynch, RJManno, PD Non-peptide fibrinogen receptor antagonists. 2. Optimization of a tyrosine template as a mimic for Arg-Gly-Asp. J Med Chem 37:2537-51 (1994)  
Target
Name:
Integrin alpha-V/beta-3
Synonyms:
ITGAV/ITGB3 | Integrin beta-3/Vitronectin receptor alpha
Type:
Enzyme
Mol. Mass.:
Description:
Components:
This complex has 2 components.
Component 1
Name:
Integrin alpha-V
Synonyms:
ITAV_HUMAN Integrin alpha-V/alpha-5 VNRA Vitronectin receptor | Vitronectin receptor subunit alpha
Type:
PROTEIN
Mol. Mass.:
116024.92
Organism:
Homo sapiens (Human)
Description:
ChEMBL_582336
Residue:
1048
  
Component 2
Name:
Integrin beta-3
Synonyms:
CD_antigen=CD61 GPIIIa ITGB3 Platelet membrane glycoprotein IIIa
Type:
Protein
Mol. Mass.:
87038.91
Organism:
Homo sapiens (Human)
Description:
P05106
Residue:
788
  
Inhibitor
Name:
BDBM50004060
Synonyms:
(S)-2-Benzyloxycarbonylamino-3-[4-(4-piperidin-4-yl-butoxy)-phenyl]-propionic acid CHEMBL85152
Type:
Small organic molecule
Emp. Form.:
C26H34N2O5
Mol. Mass.:
454.5586
SMILES:
OC(=O)[C@H](Cc1ccc(OCCCCC2CCNCC2)cc1)NC(=O)OCc1ccccc1
: