Target
Neprilysin
Ligand
BDBM50407299
Substrate
Meas. Tech.
ChEMBL_144450 (CHEMBL755097)
Ki
1.60±n/a nM
Citation
 Fournié-Zaluski, MCCoric, PTurcaud, SRousselet, NGonzalez, WBarbe, BPham, IJullian, NMichel, JBRoques, BP New dual inhibitors of neutral endopeptidase and angiotensin-converting enzyme: rational design, bioavailability, and pharmacological responses in experimental hypertension. J Med Chem 37:1070-83 (1994)  
Target
Name:
Neprilysin
Synonyms:
Atriopeptidase CD_antigen=CD10 EPN MME NEP_HUMAN Neutral endopeptidase | Neutral endopeptidase 24.11
Type:
Enzyme
Mol. Mass.:
85505.38
Organism:
Homo sapiens (Human)
Description:
P08473
Residue:
750
  
Inhibitor
Name:
BDBM50407299
Synonyms:
CHEMBL2052007
Type:
Small organic molecule
Emp. Form.:
C20H23NO3S
Mol. Mass.:
357.467
SMILES:
C[C@H]([C@@H](CS)C(=O)N[C@@H](Cc1ccccc1)C(O)=O)c1ccccc1
: