Target
Neprilysin
Ligand
BDBM50041063
Substrate
Meas. Tech.
ChEMBL_144449 (CHEMBL755096)
IC50
4±n/a nM
Citation
 Fournié-Zaluski, MCCoric, PTurcaud, SRousselet, NGonzalez, WBarbe, BPham, IJullian, NMichel, JBRoques, BP New dual inhibitors of neutral endopeptidase and angiotensin-converting enzyme: rational design, bioavailability, and pharmacological responses in experimental hypertension. J Med Chem 37:1070-83 (1994)  
Target
Name:
Neprilysin
Synonyms:
Atriopeptidase CD_antigen=CD10 EPN MME NEP_HUMAN Neutral endopeptidase | Neutral endopeptidase 24.11
Type:
Enzyme
Mol. Mass.:
85505.38
Organism:
Homo sapiens (Human)
Description:
P08473
Residue:
750
  
Inhibitor
Name:
BDBM50041063
Synonyms:
2-(2-Mercaptomethyl-3-phenyl-butyrylamino)-pentanoic acid | CHEMBL275690
Type:
Small organic molecule
Emp. Form.:
C16H23NO3S
Mol. Mass.:
309.424
SMILES:
CCCC(NC(=O)C(CS)C(C)c1ccccc1)C(O)=O
: