Target
Bromodomain adjacent to zinc finger domain protein 2B
Ligand
BDBM50495368
Substrate
Meas. Tech.
ChEMBL_1286636 (CHEMBL3111111)
IC50
14000±n/a nM
Citation
 Ferguson, FMFedorov, OChaikuad, APhilpott, MMuniz, JRFelletar, Ivon Delft, FHeightman, TKnapp, SAbell, CCiulli, A Targeting low-druggability bromodomains: fragment based screening and inhibitor design against the BAZ2B bromodomain. J Med Chem 56:10183-7 (2013)  
Target
Name:
Bromodomain adjacent to zinc finger domain protein 2B
Synonyms:
BAZ2B KIAA1476 | hWALp4
Type:
PROTEIN
Mol. Mass.:
240455.43
Organism:
Homo sapiens (Human)
Description:
ChEMBL_1498197
Residue:
2168
  
Inhibitor
Name:
BDBM50495368
Synonyms:
CHEMBL3110242
Type:
Small organic molecule
Emp. Form.:
C13H14BrN3O
Mol. Mass.:
308.174
SMILES:
CNC(=O)N1CCc2[nH]c3ccc(Br)cc3c2C1
: