Target
Bromodomain adjacent to zinc finger domain protein 2B
Ligand
BDBM50495365
Substrate
Meas. Tech.
ChEMBL_1286636 (CHEMBL3111111)
IC50
9000±n/a nM
Citation
 Ferguson, FMFedorov, OChaikuad, APhilpott, MMuniz, JRFelletar, Ivon Delft, FHeightman, TKnapp, SAbell, CCiulli, A Targeting low-druggability bromodomains: fragment based screening and inhibitor design against the BAZ2B bromodomain. J Med Chem 56:10183-7 (2013)  
Target
Name:
Bromodomain adjacent to zinc finger domain protein 2B
Synonyms:
BAZ2B KIAA1476 | hWALp4
Type:
PROTEIN
Mol. Mass.:
240455.43
Organism:
Homo sapiens (Human)
Description:
ChEMBL_1498197
Residue:
2168
  
Inhibitor
Name:
BDBM50495365
Synonyms:
CHEMBL3110241
Type:
Small organic molecule
Emp. Form.:
C13H14ClN3O
Mol. Mass.:
263.723
SMILES:
CNC(=O)N1CCc2[nH]c3ccc(Cl)cc3c2C1
: