Target
Adenosine receptor A1
Ligand
BDBM50043215
Substrate
Meas. Tech.
ChEMBL_29299 (CHEMBL640360)
Ki
164.3±n/a nM
Citation
 Peet, NPLentz, NLDudley, MWOgden, AMMcCarty, DRRacke, MM Xanthines with C8 chiral substituents as potent and selective adenosine A1 antagonists. J Med Chem 36:4015-20 (1994)  
Target
Name:
Adenosine receptor A1
Synonyms:
AA1R_RAT ADENOSINE A1 high Adenosine A1 receptor (A1) Adenosine receptors A1 | Adora1
Type:
Protein
Mol. Mass.:
36704.13
Organism:
Rattus norvegicus (rat)
Description:
Residue:
326
  
Inhibitor
Name:
BDBM50043215
Synonyms:
8-(2-Phenyl-cyclopentyl)-1,3-dipropyl-3,9-dihydro-purine-2,6-dione | CHEMBL2367993
Type:
Small organic molecule
Emp. Form.:
C22H28N4O2
Mol. Mass.:
380.4833
SMILES:
CCCn1c2[nH]c(nc2c(=O)n(CCC)c1=O)[C@H]1CCC[C@@H]1c1ccccc1
: