Target
Epidermal growth factor receptor
Ligand
BDBM50498973
Substrate
Meas. Tech.
ChEMBL_1538409 (CHEMBL3737956)
IC50
2530±n/a nM
Citation
 Heald, RBowman, KKBryan, MCBurdick, DChan, BChan, EChen, YClausen, SDominguez-Fernandez, BEigenbrot, CElliott, RHanan, EJJackson, PKnight, JLa, HLainchbury, MMalek, SMann, SMerchant, MMortara, KPurkey, HSchaefer, GSchmidt, SSeward, ESideris, SShao, LWang, SYeap, KYen, IYu, CHeffron, TP Noncovalent Mutant Selective Epidermal Growth Factor Receptor Inhibitors: A Lead Optimization Case Study. J Med Chem 58:8877-95 (2015)  
Target
Name:
Epidermal growth factor receptor
Synonyms:
EGF Receptor Substrate EGFR_HUMAN ERBB1 Epidermal Growth Factor Receptor erbB-1 Epidermal growth factor receptor (EGFR) HER1 Proto-oncogene c-ErbB-1 Tyrosine-Protein Kinase ErbB-1
Type:
Receptor Kinase Domain
Mol. Mass.:
134279.59
Organism:
Homo sapiens (Human)
Description:
P00533
Residue:
1210
  
Inhibitor
Name:
BDBM50498973
Synonyms:
CHEMBL3734934
Type:
Small organic molecule
Emp. Form.:
C19H24FN7O2
Mol. Mass.:
401.438
SMILES:
CC(C)n1c(CO)nc2cnc(Nc3ccnc(n3)N3CC[C@H](O)[C@H](F)C3)cc12
: