Target
1,3-beta-D-glucan synthase catalytic subunit
Ligand
BDBM50499808
Substrate
Meas. Tech.
ChEMBL_1541190 (CHEMBL3745192)
IC50
11.5±n/a nM
Citation
 Apgar, JMWilkening, RRGreenlee, MLBalkovec, JMFlattery, AMAbruzzo, GKGalgoci, AMGiacobbe, RAGill, CJHsu, MJLiberator, PMisura, ASMotyl, MNielsen Kahn, JPowles, MRacine, FDragovic, JHabulihaz, BFan, WKirwan, RLee, SLiu, HMamai, ANelson, KPeel, M Novel orally active inhibitors of ?-1,3-glucan synthesis derived from enfumafungin. Bioorg Med Chem Lett 25:5813-8 (2015)  
Target
Name:
1,3-beta-D-glucan synthase catalytic subunit
Synonyms:
1,3-beta-D-glucan synthase catalytic subunit | Beta-1,3-glucan synthase
Type:
PROTEIN
Mol. Mass.:
80469.77
Organism:
Candida albicans
Description:
ChEMBL_663643
Residue:
690
  
Inhibitor
Name:
BDBM50499808
Synonyms:
CHEMBL3741296
Type:
Small organic molecule
Emp. Form.:
C40H68N6O4
Mol. Mass.:
697.0057
SMILES:
[H][C@]12CC[C@@]3([H])C4(C)COC[C@@]3(C[C@H]([C@@H]4OC[C@](C)(NCCC)C(C)C)n3nnc(N)n3)C1=CC[C@@]1(C)[C@H](C(O)=O)[C@](C)(CC[C@]21C)[C@H](C)C(C)C
: