Target
Reverse transcriptase/RNaseH
Ligand
BDBM50050638
Substrate
Meas. Tech.
ChEMBL_195513 (CHEMBL800581)
IC50
11200±n/a nM
Citation
 Gussio, RPattabiraman, NZaharevitz, DWKellogg, GETopol, IARice, WGSchaeffer, CAErickson, JWBurt, SK All-atom models for the non-nucleoside binding site of HIV-1 reverse transcriptase complexed with inhibitors: a 3D QSAR approach. J Med Chem 39:1645-50 (1996)  
Target
Name:
Reverse transcriptase/RNaseH
Synonyms:
HIV-1 Reverse Transcriptase RNase H Reverse transcriptase/RNaseH
Type:
PROTEIN
Mol. Mass.:
65229.15
Organism:
Human immunodeficiency virus 1
Description:
ChEMBL_1473730
Residue:
566
  
Inhibitor
Name:
BDBM50050638
Synonyms:
8-Ethyl-2-methyl-8H-1,3a,7,8,9-pentaaza-dibenzo[e,h]azulene | CHEMBL297115
Type:
Small organic molecule
Emp. Form.:
C16H15N5
Mol. Mass.:
277.3238
SMILES:
CCN1c2ncccc2-c2nc(C)cn2-c2cccnc12
: